{"text_format":"3","workbook":"xlsx","n_sheets":4,"sheets":["Calculations","Temp Adjustments","SharePoint_Fascicle","SharePoint_Tin"],"not_rendered":{"defined_names":2},"read":"whole","date_system":"1900"}

{"sheet":"Calculations","index":0,"n_rows":44,"n_cols":31,"rows_kept":44,"merged":[[8,6,8,21],[8,22,8,27],[10,6,11,13],[10,14,10,21],[10,22,10,27],[11,15,11,17],[11,18,11,19],[11,20,11,21],[11,22,11,24],[11,25,11,27],[12,6,13,13],[12,15,12,17],[12,18,12,19],[12,20,12,21],[12,22,12,24],[12,25,12,27],[13,15,13,17],[13,18,13,19],[13,20,13,21],[13,22,13,24],[13,25,13,27],[14,3,15,4],[15,6,15,8],[15,9,15,18],[15,19,15,27],[15,29,15,30],[16,1,17,1],[16,2,17,2],[16,3,17,3],[16,4,17,4],[16,6,17,6],[16,7,17,7],[16,8,17,8],[16,9,17,9],[16,10,16,15],[16,16,16,18],[16,19,17,19],[16,20,17,21],[16,22,17,23],[16,24,17,25],[16,26,17,27],[16,29,17,29],[16,30,17,30],[18,6,27,6],[18,7,22,7],[21,19,22,19],[21,21,22,21],[21,23,21,24],[21,25,22,25],[22,23,22,24],[23,7,27,7],[26,19,27,19],[26,21,27,21],[26,23,26,24],[26,25,27,25],[27,23,27,24],[28,6,37,6],[28,7,32,7],[29,3,30,4],[31,3,32,3],[31,4,32,4],[31,19,32,19],[31,21,32,21],[31,23,31,24],[31,25,32,25],[32,23,32,24],[33,7,37,7],[36,19,37,19],[36,21,37,21],[36,23,36,24],[36,25,37,25],[37,23,37,24],[39,19,39,27],[40,8,40,17],[40,19,43,27],[74,30,74,37],[75,30,76,30],[75,31,76,31],[75,32,76,32],[75,33,76,33],[75,34,76,34],[75,35,76,35],[75,36,76,36],[75,37,76,37]]}
{"$rows_empty":8}
[{"$nulls":6},"Expanded Live Fuel Moisture Sampling Calculation Form          ",{"$nulls":15},"Mean Values Calculated in Red-Lined Cells"]
[]
[{"$nulls":6},"National Fuel Moisture Database Sample Site",{"$nulls":7},"Site Details",{"$nulls":7},"Field Collection Record"]
[{"$nulls":14},"Species","Latitude (dd.ddd)",null,null,"Longitude (dd.ddd)",null,"Elevation (ft)",null,"Observer",null,null,"Date & Time (CST)"]
[{"$nulls":14},"PR"]
[{"$nulls":14},"PJ",{"$nulls":7},{"$f":"IF(W13>0,W13,\"\")","v":""},null,null,{"$f":"IF(Z13>0,Z13,\"\")","v":""}]
[{"$nulls":3},"PR Needle Weights\n(With Retainer)"]
[{"$nulls":6},"Sample Information",null,null,"Needle Volume/Density and Relative Water Content (RWC) Calculations",{"$nulls":9},"Foliar Moisture Content (FMC) Calculation",{"$nulls":9},"FMC based on single fascicle measurements"]
[{"$nulls":3},"Dry","Wet",null,"Species","Age\nClass","Portions\n1 & 2\nShipped to Labs?\n(Check Box)","Portion 3\nFascicle #","Needle Volume/Density Calculations",{"$nulls":5},"RWC Calculations",null,null,"Portion 3\nSubset\n#","Fresh Weight (g)",null,"Dried Weight (g)",null,"Tin Weight (g)",null,"FMC (%)",null,null,"Single fascicle FMC","Mean (Top) &\nStnd Dev (bottom)\nfor 5 fascicles"]
[{"$nulls":10},"Fresh\nWeight\n(g)","Weight in\nWater\n(g)","Water\nTemp\n( C )","Water\nDensity\nAdjustment","Fresh\nNeedle\nVolume\n(cm3)","Dried Needle Density (g/cm3)","Turgid\nWeight\n(g)","Dried\nWeight\n(g)","Relative\nWater \nContent (%)"]
[{"$nulls":4},-0.228,null,"Red Pine","Old Needles","Missoula","OPR_F1",0.111,{"$f":"$E19-$E$34","v":-0.837},{"v":20,"d":"20.0"},{"$f":"IFERROR(VLOOKUP(M19,'Temp Adjustments'!$A$2:$B$42,2),\"No Data\")","v":0.99823},{"$f":"IFERROR(0.99985*((K19-L19)/(N19-0.0012)),\"No Data\")","v":{"v":0.9506813235308867,"d":"0.9507"}},{"$f":"IFERROR(R19/O19,\"No Data\")","v":{"v":0.049438227970482494,"d":"0.0494"}},null,0.047,{"$f":"((K19-R19)/(Q19-R19))","v":{"v":-1.3617021276595744,"d":"-136.2%"}},"OPR_LFM1",{"$nulls":6},{"$f":"(U19-W19)/(W19-Y19)","v":{"$error":"#DIV/0!"}},{"$f":"IFERROR((V19-X19)/(X19-Z19),\"No Data\")","v":"No Data"},null,{"$f":"IFERROR((K19-R19)/R19,\"No Data\")","v":{"v":1.3617021276595744,"d":"136.2%"}},{"$f":"IFERROR(AVERAGE(AD19:AD23),\"No Data\")","v":{"v":1.3617021276595744,"d":"136.2%"}}]
[{"$nulls":9},"OPR_F2",null,{"$f":"$E20-$E$34","v":-0.609},{"v":20,"d":"20.0"},{"$f":"IFERROR(VLOOKUP(M20,'Temp Adjustments'!$A$2:$B$42,2),\"No Data\")","v":0.99823},{"v":0.6107224958125633,"d":"0.6107"},{"v":0,"d":"0.0000"},null,null,{"$f":"((K20-R20)/(Q20-R20))","v":{"$error":"#DIV/0!"}},"OPR_LFM2",{"$nulls":6},{"$f":"(U20-W20)/(W20-Y20)","v":{"$error":"#DIV/0!"}},{"$f":"IFERROR((V20-X20)/(X20-Z20),\"No Data\")","v":"No Data"},null,{"$f":"IFERROR((K20-R20)/R20,\"No Data\")","v":"No Data"},{"$f":"IFERROR(_xlfn.STDEV.S(AD19:AD23),\"No Data\")","v":"No Data"}]
[{"$nulls":8},"Pennsylvania","OPR_F3",null,-0.609,null,{"$f":"IFERROR(VLOOKUP(M21,'Temp Adjustments'!$A$2:$B$42,2),\"No Data\")","v":"No Data"},"No Data","No Data",null,null,{"$error":"#DIV/0!"},"OPR_LFM3",{"$nulls":6},{"$error":"#DIV/0!"},{"$f":"IFERROR((V21-X21)/(X21-Z21),\"No Data\")","v":"No Data"},null,"No Data"]
[{"$nulls":9},"OPR_F4",null,-0.609,null,{"$f":"IFERROR(VLOOKUP(M22,'Temp Adjustments'!$A$2:$B$42,2),\"No Data\")","v":"No Data"},"No Data","No Data",null,null,{"$error":"#DIV/0!"},"Dried Needle\nDensity",{"$f":"IFERROR(AVERAGE(P19:P23),\"No Data\")","v":{"v":0.024719113985241247,"d":"0.0247"}},"Relative\nWater\nContent",{"$f":"AVERAGE(S19:S23)","v":{"$error":"#DIV/0!"}},"<--Mean Values-->",null,"FMC:",{"$f":"AVERAGE(AA19:AA21)","v":{"$error":"#DIV/0!"}},{"$f":"IFERROR(AVERAGE(AB19:AB21),\"No Data\")","v":"No Data"},null,"No Data"]
[{"$nulls":9},"OPR_F5",null,-0.609,null,{"$f":"IFERROR(VLOOKUP(M23,'Temp Adjustments'!$A$2:$B$42,2),\"No Data\")","v":"No Data"},"No Data","No Data",null,null,{"$error":"#DIV/0!"},null,{"$f":"IFERROR(_xlfn.STDEV.S(P19:P23),\"No Data\")","v":{"v":0.034958106247774616,"d":"0.03"}},null,{"$f":"_xlfn.STDEV.S(S19:S23)","v":{"$error":"#DIV/0!"}},"<-Standard deviations->",null,null,{"$f":"_xlfn.STDEV.S(AA19,AA20,AA21)","v":{"$error":"#DIV/0!"}},{"$f":"IFERROR(_xlfn.STDEV.S(AB19,AB20,AB21),\"No Data\")","v":"No Data"},null,"No Data"]
[{"$nulls":7},"New Needles","Missoula","NPR_F1",null,{"$f":"IF(K24>0,$E24-$E$34,0)","v":{"v":0,"d":"0.000"}},null,{"$f":"IFERROR(VLOOKUP(M24,'Temp Adjustments'!$A$2:$B$42,2),\"No Data\")","v":"No Data"},"No Data",{"$f":"IFERROR(R24/O24,\"No Data\")","v":"No Data"},null,null,{"$error":"#DIV/0!"},"NPR_LFM1",{"$nulls":6},{"$f":"(U24-W24)/(W24-Y24)","v":{"$error":"#DIV/0!"}},{"$f":"IFERROR((V24-X24)/(X24-Z24),\"No Data\")","v":"No Data"},null,"No Data",{"$f":"IFERROR(AVERAGE(AD24:AD28),\"No Data\")","v":"No Data"}]
[{"$nulls":9},"NPR_F2",null,{"$f":"IF(K25>0,$E25-$E$34,0)","v":{"v":0,"d":"0.000"}},null,{"$f":"IFERROR(VLOOKUP(M25,'Temp Adjustments'!$A$2:$B$42,2),\"No Data\")","v":"No Data"},"No Data",{"$f":"IFERROR(R25/O25,\"No Data\")","v":"No Data"},null,null,{"$error":"#DIV/0!"},"NPR_LFM2",{"$nulls":6},{"$error":"#DIV/0!"},{"$f":"IFERROR((V25-X25)/(X25-Z25),\"No Data\")","v":"No Data"},null,"No Data",{"$f":"IFERROR(_xlfn.STDEV.S(AD24:AD28),\"No Data\")","v":"No Data"}]
[{"$nulls":8},"Pennsylvania","NPR_F3",null,{"v":0,"d":"0.000"},null,{"$f":"IFERROR(VLOOKUP(M26,'Temp Adjustments'!$A$2:$B$42,2),\"No Data\")","v":"No Data"},"No Data","No Data",null,null,{"$error":"#DIV/0!"},"NPR_LFM3",{"$nulls":6},{"$error":"#DIV/0!"},{"$f":"IFERROR((V26-X26)/(X26-Z26),\"No Data\")","v":"No Data"},null,"No Data"]
[{"$nulls":9},"NPR_F4",null,{"v":0,"d":"0.000"},null,{"$f":"IFERROR(VLOOKUP(M27,'Temp Adjustments'!$A$2:$B$42,2),\"No Data\")","v":"No Data"},"No Data","No Data",null,null,{"$error":"#DIV/0!"},"Dried Needle\nDensity",{"$f":"IFERROR(AVERAGE(P24:P28),\"No Data\")","v":"No Data"},"Relative\nWater\nContent",{"$f":"AVERAGE(S24:S28)","v":{"$error":"#DIV/0!"}},"<--Mean Values-->",null,"FMC:",{"$f":"AVERAGE(AA24:AA26)","v":{"$error":"#DIV/0!"}},{"$f":"IFERROR(AVERAGE(AB24:AB26),\"No Data\")","v":"No Data"},null,"No Data"]
[{"$nulls":9},"NPR_F5",null,{"v":0,"d":"0.000"},null,{"$f":"IFERROR(VLOOKUP(M28,'Temp Adjustments'!$A$2:$B$42,2),\"No Data\")","v":"No Data"},"No Data","No Data",null,null,{"$error":"#DIV/0!"},null,{"$f":"IFERROR(_xlfn.STDEV.S(P24:P28),\"No Data\")","v":"No Data"},null,{"$f":"_xlfn.STDEV.S(S24:S28)","v":{"$error":"#DIV/0!"}},"<-Standard deviations->",null,null,{"$f":"_xlfn.STDEV.S(AA24,AA25,AA26)","v":{"$error":"#DIV/0!"}},{"$f":"IFERROR(_xlfn.STDEV.S(AB24,AB25,AB26),\"No Data\")","v":"No Data"},null,"No Data"]
[{"$nulls":6},"Jack Pine","Old Needles","Missoula","OPJ_F1",{"$nulls":3},{"$f":"IFERROR(VLOOKUP(M29,'Temp Adjustments'!$A$2:$B$42,2),\"No Data\")","v":"No Data"},"No Data","No Data",null,null,{"$error":"#DIV/0!"},"OPJ_LFM1",{"$nulls":6},{"$f":"(U29-W29)/(W29-Y29)","v":{"$error":"#DIV/0!"}},{"$f":"IFERROR((V29-X29)/(X29-Z29),\"No Data\")","v":"No Data"},null,"No Data",{"$f":"IFERROR(AVERAGE(AD29:AD33),\"No Data\")","v":"No Data"}]
[{"$nulls":3},"Retainer Weights",{"$nulls":5},"OPJ_F2",{"$nulls":3},{"$f":"IFERROR(VLOOKUP(M30,'Temp Adjustments'!$A$2:$B$42,2),\"No Data\")","v":"No Data"},"No Data","No Data",null,null,{"$error":"#DIV/0!"},"OPJ_LFM2",{"$nulls":6},{"$error":"#DIV/0!"},{"$f":"IFERROR((V30-X30)/(X30-Z30),\"No Data\")","v":"No Data"},null,"No Data",{"$f":"IFERROR(_xlfn.STDEV.S(AD29:AD33),\"No Data\")","v":"No Data"}]
[{"$nulls":8},"Pennsylvania","OPJ_F3",{"$nulls":3},{"$f":"IFERROR(VLOOKUP(M31,'Temp Adjustments'!$A$2:$B$42,2),\"No Data\")","v":"No Data"},"No Data","No Data",null,null,{"$error":"#DIV/0!"},"OPJ_LFM3",{"$nulls":6},{"$error":"#DIV/0!"},{"$f":"IFERROR((V31-X31)/(X31-Z31),\"No Data\")","v":"No Data"},null,"No Data"]
[{"$nulls":3},"Dry","Wet",{"$nulls":4},"OPJ_F4",{"$nulls":3},{"$f":"IFERROR(VLOOKUP(M32,'Temp Adjustments'!$A$2:$B$42,2),\"No Data\")","v":"No Data"},"No Data","No Data",null,null,{"$error":"#DIV/0!"},"Dried Needle\nDensity",{"$f":"IFERROR(AVERAGE(P29:P33),\"No Data\")","v":"No Data"},"Relative\nWater\nContent",{"$f":"AVERAGE(S29:S33)","v":{"$error":"#DIV/0!"}},"<--Mean Values-->",null,"FMC:",{"$f":"AVERAGE(AA29:AA31)","v":{"$error":"#DIV/0!"}},{"$f":"IFERROR(AVERAGE(AB29:AB31),\"No Data\")","v":"No Data"},null,"No Data"]
[{"$nulls":9},"OPJ_F5",{"$nulls":3},{"$f":"IFERROR(VLOOKUP(M33,'Temp Adjustments'!$A$2:$B$42,2),\"No Data\")","v":"No Data"},"No Data","No Data",null,null,{"$error":"#DIV/0!"},null,{"$f":"IFERROR(_xlfn.STDEV.S(P29:P33),\"No Data\")","v":"No Data"},null,{"$f":"_xlfn.STDEV.S(S29:S33)","v":{"$error":"#DIV/0!"}},"<-Standard deviations->",null,null,{"$f":"_xlfn.STDEV.S(AA29,AA30,AA31)","v":{"$error":"#DIV/0!"}},{"$f":"IFERROR(_xlfn.STDEV.S(AB29,AB30,AB31),\"No Data\")","v":"No Data"},null,"No Data"]
[{"$nulls":4},0.609,null,null,"New Needles","Missoula","NPJ_F1",{"$nulls":3},{"$f":"IFERROR(VLOOKUP(M34,'Temp Adjustments'!$A$2:$B$42,2),\"No Data\")","v":"No Data"},"No Data","No Data",null,null,{"$error":"#DIV/0!"},"NPJ_LFM1",{"$nulls":6},{"$f":"(U34-W34)/(W34-Y34)","v":{"$error":"#DIV/0!"}},{"$f":"IFERROR((V34-X34)/(X34-Z34),\"No Data\")","v":"No Data"},null,"No Data",{"$f":"IFERROR(AVERAGE(AD34:AD38),\"No Data\")","v":"No Data"}]
[{"$nulls":9},"NPJ_F2",{"$nulls":3},{"$f":"IFERROR(VLOOKUP(M35,'Temp Adjustments'!$A$2:$B$42,2),\"No Data\")","v":"No Data"},"No Data","No Data",null,null,{"$error":"#DIV/0!"},"NPJ_LFM2",{"$nulls":6},{"$error":"#DIV/0!"},{"$f":"IFERROR((V35-X35)/(X35-Z35),\"No Data\")","v":"No Data"},null,"No Data",{"$f":"IFERROR(_xlfn.STDEV.S(AD34:AD38),\"No Data\")","v":"No Data"}]
[{"$nulls":8},"Pennsylvania","NPJ_F3",{"$nulls":3},{"$f":"IFERROR(VLOOKUP(M36,'Temp Adjustments'!$A$2:$B$42,2),\"No Data\")","v":"No Data"},"No Data","No Data",null,null,{"$error":"#DIV/0!"},"NPJ_LFM3",{"$nulls":6},{"$error":"#DIV/0!"},{"$f":"IFERROR((V36-X36)/(X36-Z36),\"No Data\")","v":"No Data"},null,"No Data"]
[{"$nulls":9},"NPJ_F4",{"$nulls":3},{"$f":"IFERROR(VLOOKUP(M37,'Temp Adjustments'!$A$2:$B$42,2),\"No Data\")","v":"No Data"},"No Data","No Data",null,null,{"$error":"#DIV/0!"},"Dried Needle\nDensity",{"$f":"IFERROR(AVERAGE(P34:P38),\"No Data\")","v":"No Data"},"Relative\nWater\nContent",{"$f":"AVERAGE(S34:S38)","v":{"$error":"#DIV/0!"}},"<--Mean Values-->",null,"FMC:",{"$f":"AVERAGE(AA34:AA36)","v":{"$error":"#DIV/0!"}},{"$f":"IFERROR(AVERAGE(AB34:AB36),\"No Data\")","v":"No Data"},null,"No Data"]
[{"$nulls":9},"NPJ_F5",{"$nulls":3},{"$f":"IFERROR(VLOOKUP(M38,'Temp Adjustments'!$A$2:$B$42,2),\"No Data\")","v":"No Data"},"No Data","No Data",null,null,{"$error":"#DIV/0!"},null,{"$f":"IFERROR(_xlfn.STDEV.S(P34:P38),\"No Data\")","v":"No Data"},null,{"$f":"_xlfn.STDEV.S(S34:S38)","v":{"$error":"#DIV/0!"}},"<-Standard deviations->",null,null,{"$f":"_xlfn.STDEV.S(AA34,AA35,AA36)","v":{"$error":"#DIV/0!"}},{"$f":"IFERROR(_xlfn.STDEV.S(AB34,AB35,AB36),\"No Data\")","v":"No Data"},null,"No Data"]
[]
[{"$nulls":19},"Additional Observations Regarding Weather, Fuels, Site, Etc.:"]
[{"$nulls":8},"Phenological Observations (Check all that apply)"]
[{"$nulls":8},"Species","Dormant","Buds\nSwelling","Buds\nCandling","Needles\nErupting","Pollination\noccurring","Growth Complete\n(Bud set)","New Growth\nLignified","Needles\nCuring/\nFalling","Frost/Freeze\nsince last sample"]
[{"$nulls":8},"Red Pine"]
[{"$nulls":8},"Jack Pine"]

{"sheet":"Temp Adjustments","index":1,"n_rows":42,"n_cols":2,"rows_kept":42,"hidden":true}
["Temp (°C)","Adjustment Factor"]
[{"v":10,"d":"10.0"},0.99973]
[10.5,0.99968]
[{"v":11,"d":"11.0"},0.99963]
[11.5,0.99958]
[{"v":12,"d":"12.0"},0.99953]
[12.5,0.99947]
[{"v":13,"d":"13.0"},0.99941]
[13.5,0.99934]
[{"v":14,"d":"14.0"},0.99927]
[14.5,{"v":0.9992,"d":"0.99920"}]
[{"v":15,"d":"15.0"},0.99913]
[15.5,0.99905]
[{"v":16,"d":"16.0"},0.99897]
[16.5,0.99889]
[{"v":17,"d":"17.0"},{"v":0.9988,"d":"0.99880"}]
[17.5,0.99871]
[{"v":18,"d":"18.0"},0.99862]
[18.5,0.99853]
[{"v":19,"d":"19.0"},0.99843]
[19.5,0.99833]
[{"v":20,"d":"20.0"},0.99823]
[20.5,0.99813]
[{"v":21,"d":"21.0"},0.99802]
[21.5,0.99791]
[{"v":22,"d":"22.0"},{"v":0.9978,"d":"0.99780"}]
[22.5,0.99768]
[{"v":23,"d":"23.0"},0.99756]
[23.5,0.99744]
[{"v":24,"d":"24.0"},0.99732]
[24.5,{"v":0.9972,"d":"0.99720"}]
[{"v":25,"d":"25.0"},0.99707]
[25.5,0.99694]
[{"v":26,"d":"26.0"},0.99681]
[26.5,0.99668]
[{"v":27,"d":"27.0"},0.99654]
[27.5,{"v":0.9964,"d":"0.99640"}]
[{"v":28,"d":"28.0"},0.99626]
[28.5,0.99612]
[{"v":29,"d":"29.0"},0.99597]
[29.5,0.99582]
[{"v":30,"d":"30.0"},0.99567]

{"sheet":"SharePoint_Fascicle","index":2,"n_rows":24,"n_cols":10,"rows_kept":24}
[{"$f":"Calculations!$G$13&\"-\"&Calculations!$O$13","v":"-PR"},{"$f":"Calculations!$Z$13","v":"00:00:00"},{"$f":"Calculations!$G$19","v":"Red Pine"},"Old",{"$f":"Calculations!K19","v":0.111},{"$f":"Calculations!R19","v":0.047},{"$f":"Calculations!L19","v":-0.837},{"$f":"Calculations!M19","v":20},"Enter on SP","Fascicle"]
[{"$f":"Calculations!$G$13&\"-\"&Calculations!$O$13","v":"-PR"},{"$f":"Calculations!$Z$13","v":"00:00:00"},{"$f":"Calculations!$G$19","v":"Red Pine"},"Old",{"$f":"Calculations!K20","v":0},{"$f":"Calculations!R20","v":0},{"$f":"Calculations!L20","v":-0.609},{"$f":"Calculations!M20","v":20},"Enter on SP","Fascicle"]
[{"$f":"Calculations!$G$13&\"-\"&Calculations!$O$13","v":"-PR"},{"$f":"Calculations!$Z$13","v":"00:00:00"},{"$f":"Calculations!$G$19","v":"Red Pine"},"Old",{"$f":"Calculations!K21","v":0},{"$f":"Calculations!R21","v":0},{"$f":"Calculations!L21","v":-0.609},{"$f":"Calculations!M21","v":0},"Enter on SP","Fascicle"]
[{"$f":"Calculations!$G$13&\"-\"&Calculations!$O$13","v":"-PR"},{"$f":"Calculations!$Z$13","v":"00:00:00"},{"$f":"Calculations!$G$19","v":"Red Pine"},"Old",{"$f":"Calculations!K22","v":0},{"$f":"Calculations!R22","v":0},{"$f":"Calculations!L22","v":-0.609},{"$f":"Calculations!M22","v":0},"Enter on SP","Fascicle"]
[{"$f":"Calculations!$G$13&\"-\"&Calculations!$O$13","v":"-PR"},{"$f":"Calculations!$Z$13","v":"00:00:00"},{"$f":"Calculations!$G$19","v":"Red Pine"},"Old",{"$f":"Calculations!K23","v":0},{"$f":"Calculations!R23","v":0},{"$f":"Calculations!L23","v":-0.609},{"$f":"Calculations!M23","v":0},"Enter on SP","Fascicle"]
[{"$f":"Calculations!$G$13&\"-\"&Calculations!$O$13","v":"-PR"},{"$f":"Calculations!$Z$13","v":"00:00:00"},{"$f":"Calculations!$G$19","v":"Red Pine"},"New",{"$f":"Calculations!K24","v":0},{"$f":"Calculations!R24","v":0},{"$f":"Calculations!L24","v":0},{"$f":"Calculations!M24","v":0},"Enter on SP","Fascicle"]
[{"$f":"Calculations!$G$13&\"-\"&Calculations!$O$13","v":"-PR"},{"$f":"Calculations!$Z$13","v":"00:00:00"},{"$f":"Calculations!$G$19","v":"Red Pine"},"New",{"$f":"Calculations!K25","v":0},{"$f":"Calculations!R25","v":0},{"$f":"Calculations!L25","v":0},{"$f":"Calculations!M25","v":0},"Enter on SP","Fascicle"]
[{"$f":"Calculations!$G$13&\"-\"&Calculations!$O$13","v":"-PR"},{"$f":"Calculations!$Z$13","v":"00:00:00"},{"$f":"Calculations!$G$19","v":"Red Pine"},"New",{"$f":"Calculations!K26","v":0},{"$f":"Calculations!R26","v":0},{"$f":"Calculations!L26","v":0},{"$f":"Calculations!M26","v":0},"Enter on SP","Fascicle"]
[{"$f":"Calculations!$G$13&\"-\"&Calculations!$O$13","v":"-PR"},{"$f":"Calculations!$Z$13","v":"00:00:00"},{"$f":"Calculations!$G$19","v":"Red Pine"},"New",{"$f":"Calculations!K27","v":0},{"$f":"Calculations!R27","v":0},{"$f":"Calculations!L27","v":0},{"$f":"Calculations!M27","v":0},"Enter on SP","Fascicle"]
[{"$f":"Calculations!$G$13&\"-\"&Calculations!$O$13","v":"-PR"},{"$f":"Calculations!$Z$13","v":"00:00:00"},{"$f":"Calculations!$G$19","v":"Red Pine"},"New",{"$f":"Calculations!K28","v":0},{"$f":"Calculations!R28","v":0},{"$f":"Calculations!L28","v":0},{"$f":"Calculations!M28","v":0},"Enter on SP","Fascicle"]
[{"$f":"Calculations!$G$13&\"-\"&Calculations!$O$14","v":"-PJ"},{"$f":"Calculations!$Z$14","v":""},{"$f":"Calculations!$G$29","v":"Jack Pine"},"Old",{"$f":"Calculations!K29","v":0},{"$f":"Calculations!R29","v":0},{"$f":"Calculations!L29","v":0},{"$f":"Calculations!M29","v":0},"Enter on SP","Fascicle"]
[{"$f":"Calculations!$G$13&\"-\"&Calculations!$O$14","v":"-PJ"},{"$f":"Calculations!$Z$14","v":""},{"$f":"Calculations!$G$29","v":"Jack Pine"},"Old",{"$f":"Calculations!K30","v":0},{"$f":"Calculations!R30","v":0},{"$f":"Calculations!L30","v":0},{"$f":"Calculations!M30","v":0},"Enter on SP","Fascicle"]
[{"$f":"Calculations!$G$13&\"-\"&Calculations!$O$14","v":"-PJ"},{"$f":"Calculations!$Z$14","v":""},{"$f":"Calculations!$G$29","v":"Jack Pine"},"Old",{"$f":"Calculations!K31","v":0},{"$f":"Calculations!R31","v":0},{"$f":"Calculations!L31","v":0},{"$f":"Calculations!M31","v":0},"Enter on SP","Fascicle"]
[{"$f":"Calculations!$G$13&\"-\"&Calculations!$O$14","v":"-PJ"},{"$f":"Calculations!$Z$14","v":""},{"$f":"Calculations!$G$29","v":"Jack Pine"},"Old",{"$f":"Calculations!K32","v":0},{"$f":"Calculations!R32","v":0},{"$f":"Calculations!L32","v":0},{"$f":"Calculations!M32","v":0},"Enter on SP","Fascicle"]
[{"$f":"Calculations!$G$13&\"-\"&Calculations!$O$14","v":"-PJ"},{"$f":"Calculations!$Z$14","v":""},{"$f":"Calculations!$G$29","v":"Jack Pine"},"Old",{"$f":"Calculations!K33","v":0},{"$f":"Calculations!R33","v":0},{"$f":"Calculations!L33","v":0},{"$f":"Calculations!M33","v":0},"Enter on SP","Fascicle"]
[{"$f":"Calculations!$G$13&\"-\"&Calculations!$O$14","v":"-PJ"},{"$f":"Calculations!$Z$14","v":""},{"$f":"Calculations!$G$29","v":"Jack Pine"},"New",{"$f":"Calculations!K34","v":0},{"$f":"Calculations!R34","v":0},{"$f":"Calculations!L34","v":0},{"$f":"Calculations!M34","v":0},"Enter on SP","Fascicle"]
[{"$f":"Calculations!$G$13&\"-\"&Calculations!$O$14","v":"-PJ"},{"$f":"Calculations!$Z$14","v":""},{"$f":"Calculations!$G$29","v":"Jack Pine"},"New",{"$f":"Calculations!K35","v":0},{"$f":"Calculations!R35","v":0},{"$f":"Calculations!L35","v":0},{"$f":"Calculations!M35","v":0},"Enter on SP","Fascicle"]
[{"$f":"Calculations!$G$13&\"-\"&Calculations!$O$14","v":"-PJ"},{"$f":"Calculations!$Z$14","v":""},{"$f":"Calculations!$G$29","v":"Jack Pine"},"New",{"$f":"Calculations!K36","v":0},{"$f":"Calculations!R36","v":0},{"$f":"Calculations!L36","v":0},{"$f":"Calculations!M36","v":0},"Enter on SP","Fascicle"]
[{"$f":"Calculations!$G$13&\"-\"&Calculations!$O$14","v":"-PJ"},{"$f":"Calculations!$Z$14","v":""},{"$f":"Calculations!$G$29","v":"Jack Pine"},"New",{"$f":"Calculations!K37","v":0},{"$f":"Calculations!R37","v":0},{"$f":"Calculations!L37","v":0},{"$f":"Calculations!M37","v":0},"Enter on SP","Fascicle"]
[{"$f":"Calculations!$G$13&\"-\"&Calculations!$O$14","v":"-PJ"},{"$f":"Calculations!$Z$14","v":""},{"$f":"Calculations!$G$29","v":"Jack Pine"},"New",{"$f":"Calculations!K38","v":0},{"$f":"Calculations!R38","v":0},{"$f":"Calculations!L38","v":0},{"$f":"Calculations!M38","v":0},"Enter on SP","Fascicle"]
[]
[]
["Note: Copy everything in the red box and Open Microsoft Internet Explorer then paste it into the first cell in the EMPTY row of the SharePoint DataEntry form here:"]
["https://connect.mn.gov/sites/DNR/division/forestry/teams/glffc/Lists/GLFFC_LFM_Data_Entry/DataEntry.aspx#"]

{"sheet":"SharePoint_Tin","index":3,"n_rows":16,"n_cols":10,"rows_kept":16,"merged":[[15,0,15,8]]}
[{"$f":"Calculations!$G$13&\"-\"&Calculations!$O$13","v":"-PR"},{"$f":"Calculations!$Z$13","v":"00:00:00"},{"$f":"Calculations!$G$19","v":"Red Pine"},"Old",{"$f":"Calculations!V19","v":0},{"$f":"Calculations!X19","v":0},{"$f":"Calculations!Z19","v":0},null,"Enter on SP","Tin"]
[{"$f":"Calculations!$G$13&\"-\"&Calculations!$O$13","v":"-PR"},{"$f":"Calculations!$Z$13","v":"00:00:00"},{"$f":"Calculations!$G$19","v":"Red Pine"},"Old",{"$f":"Calculations!V20","v":0},{"$f":"Calculations!X20","v":0},{"$f":"Calculations!Z20","v":0},null,"Enter on SP","Tin"]
[{"$f":"Calculations!$G$13&\"-\"&Calculations!$O$13","v":"-PR"},{"$f":"Calculations!$Z$13","v":"00:00:00"},{"$f":"Calculations!$G$19","v":"Red Pine"},"Old",{"$f":"Calculations!V21","v":0},{"$f":"Calculations!X21","v":0},{"$f":"Calculations!Z21","v":0},null,"Enter on SP","Tin"]
[{"$f":"Calculations!$G$13&\"-\"&Calculations!$O$13","v":"-PR"},{"$f":"Calculations!$Z$13","v":"00:00:00"},{"$f":"Calculations!$G$19","v":"Red Pine"},"New",{"$f":"Calculations!V24","v":0},{"$f":"Calculations!X24","v":0},{"$f":"Calculations!Z24","v":0},null,"Enter on SP","Tin"]
[{"$f":"Calculations!$G$13&\"-\"&Calculations!$O$13","v":"-PR"},{"$f":"Calculations!$Z$13","v":"00:00:00"},{"$f":"Calculations!$G$19","v":"Red Pine"},"New",{"$f":"Calculations!V25","v":0},{"$f":"Calculations!X25","v":0},{"$f":"Calculations!Z25","v":0},null,"Enter on SP","Tin"]
[{"$f":"Calculations!$G$13&\"-\"&Calculations!$O$13","v":"-PR"},{"$f":"Calculations!$Z$13","v":"00:00:00"},{"$f":"Calculations!$G$19","v":"Red Pine"},"New",{"$f":"Calculations!V26","v":0},{"$f":"Calculations!X26","v":0},{"$f":"Calculations!Z26","v":0},null,"Enter on SP","Tin"]
[{"$f":"Calculations!$G$13&\"-\"&Calculations!$O$14","v":"-PJ"},{"$f":"Calculations!$Z$13","v":"00:00:00"},{"$f":"Calculations!$G$29","v":"Jack Pine"},"Old",{"$f":"Calculations!V29","v":0},{"$f":"Calculations!X29","v":0},{"$f":"Calculations!Z29","v":0},null,"Enter on SP","Tin"]
[{"$f":"Calculations!$G$13&\"-\"&Calculations!$O$14","v":"-PJ"},{"$f":"Calculations!$Z$13","v":"00:00:00"},{"$f":"Calculations!$G$29","v":"Jack Pine"},"Old",{"$f":"Calculations!V30","v":0},{"$f":"Calculations!X30","v":0},{"$f":"Calculations!Z30","v":0},null,"Enter on SP","Tin"]
[{"$f":"Calculations!$G$13&\"-\"&Calculations!$O$14","v":"-PJ"},{"$f":"Calculations!$Z$13","v":"00:00:00"},{"$f":"Calculations!$G$29","v":"Jack Pine"},"Old",{"$f":"Calculations!V31","v":0},{"$f":"Calculations!X31","v":0},{"$f":"Calculations!Z31","v":0},null,"Enter on SP","Tin"]
[{"$f":"Calculations!$G$13&\"-\"&Calculations!$O$14","v":"-PJ"},{"$f":"Calculations!$Z$13","v":"00:00:00"},{"$f":"Calculations!$G$29","v":"Jack Pine"},"New",{"$f":"Calculations!V34","v":0},{"$f":"Calculations!X34","v":0},{"$f":"Calculations!Z34","v":0},null,"Enter on SP","Tin"]
[{"$f":"Calculations!$G$13&\"-\"&Calculations!$O$14","v":"-PJ"},{"$f":"Calculations!$Z$13","v":"00:00:00"},{"$f":"Calculations!$G$29","v":"Jack Pine"},"New",{"$f":"Calculations!V35","v":0},{"$f":"Calculations!X35","v":0},{"$f":"Calculations!Z35","v":0},null,"Enter on SP","Tin"]
[{"$f":"Calculations!$G$13&\"-\"&Calculations!$O$14","v":"-PJ"},{"$f":"Calculations!$Z$13","v":"00:00:00"},{"$f":"Calculations!$G$29","v":"Jack Pine"},"New",{"$f":"Calculations!V36","v":0},{"$f":"Calculations!X36","v":0},{"$f":"Calculations!Z36","v":0},null,"Enter on SP","Tin"]
[]
[]
["Note: Copy everything in the red box and Open Microsoft Internet Explorer then paste it into the first cell in the EMPTY row of the SharePoint DataEntry form here:"]
["https://connect.mn.gov/sites/DNR/division/forestry/teams/glffc/Lists/GLFFC_LFM_Data_Entry/DataEntry.aspx#"]